FreeBSD-main-amd64-test - Build #22567 - Still Unstable

From: <>
Date: Thu, 01 Dec 2022 15:59:30 UTC
FreeBSD-main-amd64-test - Build #22567 (984b27d879e14d88834ddfb7b9f9a4c40a84c492) - Still Unstable

Build information:
Full change log:
Full build log:

Status explanation:
"Unstable" - some tests are suspected being broken by the following changes
"Still Unstable" - the failing test cases have not been fixed by these
                   following changes and this is a notification to note that
                   these changes have not been fully tested by the CI system

Change summaries:
(Those commits are likely but not certainly responsible)

984b27d879e14d88834ddfb7b9f9a4c40a84c492 by melifaro:
net: add if_allocdescr() to permit updating iface description from the

The failed test cases:

3 tests failed.
FAILED:  sys.fs.fusefs.mknod.main

Error Message:
Returned non-success exit status 1

FAILED:  sys.kern.ktls_test.ktls_receive_aes128_cbc_1_1_sha1_oversized_record

Error Message:
/usr/src/tests/sys/kern/ktls_test.c:1511: errno == expected_error not met

FAILED:  sys.kern.ktls_test.ktls_receive_aes128_cbc_1_2_sha384_oversized_record

Error Message:
/usr/src/tests/sys/kern/ktls_test.c:1511: errno == expected_error not met