FreeBSD-main-amd64-test - Build #21921 - Still Unstable

From: <>
Date: Tue, 23 Aug 2022 23:49:26 UTC
FreeBSD-main-amd64-test - Build #21921 (e66390736613a452238531f64bb9f674ebd4c3a6) - Still Unstable

Build information:
Full change log:
Full build log:

Status explanation:
"Unstable" - some tests are suspected being broken by the following changes
"Still Unstable" - the failing test cases have not been fixed by these
                   following changes and this is a notification to note that
                   these changes have not been fully tested by the CI system

Change summaries:
(Those commits are likely but not certainly responsible)

e66390736613a452238531f64bb9f674ebd4c3a6 by jhb:
Define _NPCM and the last PC_FREEn constant in terms of _NPCPV.

The failed test cases:

3 tests failed.
FAILED:  sys.fs.fusefs.symlink.main

Error Message:
Returned non-success exit status 1

FAILED:  usr.bin.tail.tail_test.follow_stdin

Error Message:
atf-check failed; see the output of the test for details

FAILED:  sys.fs.fusefs.mknod.main

Error Message:
Returned non-success exit status 1