FreeBSD-main-amd64-test - Build #21764 - Still Unstable

From: <jenkins-admin_at_FreeBSD.org>
Date: Wed, 03 Aug 2022 10:38:45 UTC
FreeBSD-main-amd64-test - Build #21764 (e21dc161b3465b138b756fdc31a979e1bfb8f8ef) - Still Unstable

Build information: https://ci.FreeBSD.org/job/FreeBSD-main-amd64-test/21764/
Full change log: https://ci.FreeBSD.org/job/FreeBSD-main-amd64-test/21764/changes
Full build log: https://ci.FreeBSD.org/job/FreeBSD-main-amd64-test/21764/console

Status explanation:
"Unstable" - some tests are suspected being broken by the following changes
"Still Unstable" - the failing test cases have not been fixed by these
                   following changes and this is a notification to note that
                   these changes have not been fully tested by the CI system

Change summaries:
(Those commits are likely but not certainly responsible)

e21dc161b3465b138b756fdc31a979e1bfb8f8ef by zirias:
Add me as ports committer, update mentor/mentee



The failed test cases:

46 tests failed.
FAILED:  lib.googletest.gtest_main.googletest-death-test-test.main

Error Message:
Returned non-success exit status 1

FAILED:  sys.kern.ptrace_test.ptrace__PT_CONTINUE_change_sig

Error Message:
Test case body timed out

FAILED:  sys.kern.ptrace_test.ptrace__PT_CONTINUE_different_thread

Error Message:
/usr/src/tests/sys/kern/ptrace_test.c:3820: WSTOPSIG(status) (5) == SIGSTOP (17) not met

FAILED:  sys.kern.ptrace_test.ptrace__PT_CONTINUE_with_sigmask

Error Message:
Test case body timed out

FAILED:  sys.kern.ptrace_test.ptrace__PT_CONTINUE_with_signal_full_sigqueue

Error Message:
/usr/src/tests/sys/kern/ptrace_test.c:2500: WIFSTOPPED(status) not met

FAILED:  sys.kern.ptrace_test.ptrace__PT_CONTINUE_with_signal_kqueue

Error Message:
Test case body timed out

FAILED:  sys.kern.ptrace_test.ptrace__PT_CONTINUE_with_signal_masked_full_sigqueue

Error Message:
Test case body timed out

FAILED:  sys.kern.ptrace_test.ptrace__PT_CONTINUE_with_signal_mix

Error Message:
/usr/src/tests/sys/kern/ptrace_test.c:2781: WIFSTOPPED(status) not met

FAILED:  sys.kern.ptrace_test.ptrace__PT_CONTINUE_with_signal_system_call_entry

Error Message:
/usr/src/tests/sys/kern/ptrace_test.c:2344: WIFSTOPPED(status) not met

FAILED:  sys.kern.ptrace_test.ptrace__PT_CONTINUE_with_signal_system_call_entry_and_exit

Error Message:
/usr/src/tests/sys/kern/ptrace_test.c:2421: WIFSTOPPED(status) not met

FAILED:  sys.kern.ptrace_test.ptrace__PT_CONTINUE_with_signal_thread_sigmask

Error Message:
Test case body timed out

FAILED:  sys.kern.ptrace_test.ptrace__PT_CONTINUE_with_sigtrap_system_call_entry

Error Message:
/usr/src/tests/sys/kern/ptrace_test.c:2718: WIFSTOPPED(status) not met

FAILED:  sys.kern.ptrace_test.ptrace__PT_KILL_breakpoint

Error Message:
/usr/src/tests/sys/kern/ptrace_test.c:1843: WSTOPSIG(status) (5) == SIGSTOP (17) not met

FAILED:  sys.kern.ptrace_test.ptrace__PT_KILL_competing_signal

Error Message:
Test case body timed out

FAILED:  sys.kern.ptrace_test.ptrace__PT_KILL_competing_stop

Error Message:
/usr/src/tests/sys/kern/ptrace_test.c:2167: WIFSTOPPED(status) not met

FAILED:  sys.kern.ptrace_test.ptrace__PT_KILL_system_call

Error Message:
/usr/src/tests/sys/kern/ptrace_test.c:1890: WIFSTOPPED(status) not met

FAILED:  sys.kern.ptrace_test.ptrace__PT_KILL_threads

Error Message:
/usr/src/tests/sys/kern/ptrace_test.c:1940: WIFSTOPPED(status) not met

FAILED:  sys.kern.ptrace_test.ptrace__PT_KILL_with_signal_full_sigqueue

Error Message:
/usr/src/tests/sys/kern/ptrace_test.c:2295: WIFSTOPPED(status) not met

FAILED:  sys.kern.ptrace_test.ptrace__PT_LWPINFO_stale_siginfo

Error Message:
/usr/src/tests/sys/kern/ptrace_test.c:3967: WSTOPSIG(status) (6) == SIGSTOP (17) not met

FAILED:  sys.kern.ptrace_test.ptrace__PT_REGSET

Error Message:
/usr/src/tests/sys/kern/ptrace_test.c:3224: WIFSTOPPED(status) not met

FAILED:  sys.kern.ptrace_test.ptrace__PT_STEP_with_signal

Error Message:
/usr/src/tests/sys/kern/ptrace_test.c:3615: WSTOPSIG(status) (6) == SIGSTOP (17) not met

FAILED:  sys.kern.ptrace_test.ptrace__breakpoint_siginfo

Error Message:
/usr/src/tests/sys/kern/ptrace_test.c:3692: WSTOPSIG(status) (5) == SIGSTOP (17) not met

FAILED:  sys.kern.ptrace_test.ptrace__event_mask

Error Message:
/usr/src/tests/sys/kern/ptrace_test.c:1662: WIFSTOPPED(status) not met

FAILED:  sys.kern.ptrace_test.ptrace__event_mask_sigkill_discard

Error Message:
/usr/src/tests/sys/kern/ptrace_test.c:3438: WIFSTOPPED(status) not met

FAILED:  sys.kern.ptrace_test.ptrace__follow_fork_both_attached

Error Message:
/usr/src/tests/sys/kern/ptrace_test.c:662: WIFSTOPPED(status) not met

FAILED:  sys.kern.ptrace_test.ptrace__follow_fork_child_detached

Error Message:
/usr/src/tests/sys/kern/ptrace_test.c:718: WIFSTOPPED(status) not met

FAILED:  sys.kern.ptrace_test.ptrace__follow_fork_parent_detached

Error Message:
/usr/src/tests/sys/kern/ptrace_test.c:769: WIFSTOPPED(status) not met

FAILED:  sys.kern.ptrace_test.ptrace__killed_with_sigmask

Error Message:
Test case body timed out

FAILED:  sys.kern.ptrace_test.ptrace__lwp_events

Error Message:
/usr/src/tests/sys/kern/ptrace_test.c:1350: WIFSTOPPED(status) not met

FAILED:  sys.kern.ptrace_test.ptrace__lwp_events_exec

Error Message:
/usr/src/tests/sys/kern/ptrace_test.c:1440: WSTOPSIG(status) (5) == SIGSTOP (17) not met

FAILED:  sys.kern.ptrace_test.ptrace__new_child_pl_syscall_code_fork

Error Message:
/usr/src/tests/sys/kern/ptrace_test.c:1132: WIFSTOPPED(status) not met

FAILED:  sys.kern.ptrace_test.ptrace__new_child_pl_syscall_code_thread

Error Message:
/usr/src/tests/sys/kern/ptrace_test.c:1273: WIFSTOPPED(status) not met

FAILED:  sys.kern.ptrace_test.ptrace__new_child_pl_syscall_code_vfork

Error Message:
/usr/src/tests/sys/kern/ptrace_test.c:603: WIFSTOPPED(status) not met

FAILED:  sys.kern.ptrace_test.ptrace__parent_terminate_with_pending_sigstop1

Error Message:
/usr/src/tests/sys/kern/ptrace_test.c:3374: WEXITSTATUS(status) (32) == 0 (0) not met

FAILED:  sys.kern.ptrace_test.ptrace__parent_terminate_with_pending_sigstop2

Error Message:
Test case body timed out

FAILED:  sys.kern.ptrace_test.ptrace__parent_wait_after_trace_me

Error Message:
/usr/src/tests/sys/kern/ptrace_test.c:213: WIFSTOPPED(status) not met

FAILED:  sys.kern.ptrace_test.ptrace__procdesc_reparent_wait_child

Error Message:
/usr/src/tests/sys/kern/ptrace_test.c:4317: WEXITSTATUS(status) (1) == 0 (0) not met

FAILED:  sys.kern.ptrace_test.ptrace__procdesc_wait_child

Error Message:
/usr/src/tests/sys/kern/ptrace_test.c:4250: WIFSTOPPED(status) not met

FAILED:  sys.kern.ptrace_test.ptrace__ptrace_exec_disable

Error Message:
/usr/src/tests/sys/kern/ptrace_test.c:1583: WSTOPSIG(status) (5) == SIGSTOP (17) not met

FAILED:  sys.kern.ptrace_test.ptrace__ptrace_exec_enable

Error Message:
/usr/src/tests/sys/kern/ptrace_test.c:1618: WSTOPSIG(status) (5) == SIGSTOP (17) not met

FAILED:  sys.kern.ptrace_test.ptrace__ptrace_vfork

Error Message:
/usr/src/tests/sys/kern/ptrace_test.c:1731: WIFSTOPPED(status) not met

FAILED:  sys.kern.ptrace_test.ptrace__ptrace_vfork_follow

Error Message:
/usr/src/tests/sys/kern/ptrace_test.c:603: WIFSTOPPED(status) not met

FAILED:  sys.kern.ptrace_test.ptrace__step_siginfo

Error Message:
/usr/src/tests/sys/kern/ptrace_test.c:3743: WIFSTOPPED(status) not met

FAILED:  sys.kern.ptrace_test.ptrace__syscall_args

Error Message:
/usr/src/tests/sys/kern/ptrace_test.c:4042: WIFSTOPPED(status) not met

FAILED:  sys.vm.mlock_test.mlock__copy_on_write_anon

Error Message:
/usr/src/tests/sys/vm/mlock_test.c:66: child exited with status 0

FAILED:  sys.vm.mlock_test.mlock__copy_on_write_vnode

Error Message:
/usr/src/tests/sys/vm/mlock_test.c:66: child exited with status 0