FreeBSD-main-amd64-test - Build #21166 - Still Unstable

From: <>
Date: Mon, 18 Apr 2022 11:34:34 UTC
FreeBSD-main-amd64-test - Build #21166 (47bcbde91dea630d4996b1a7b2c33925fe8d5b5b) - Still Unstable

Build information:
Full change log:
Full build log:

Status explanation:
"Unstable" - some tests are suspected being broken by the following changes
"Still Unstable" - the failing test cases have not been fixed by these
                   following changes and this is a notification to note that
                   these changes have not been fully tested by the CI system

Change summaries:
(Those commits are likely but not certainly responsible)

4cd4841a2773d3674151f4acef0a1bf05212c87d by pstef:
Modularize uuencode and uudecode by wrapping them in bintrans.c

47bcbde91dea630d4996b1a7b2c33925fe8d5b5b by pstef:
bintrans: move files to a new directory

The failed test cases:

4 tests failed.
FAILED:  sys.kern.ptrace_test.ptrace__follow_fork_parent_detached_unrelated_debugger

Error Message:
/usr/src/tests/sys/kern/ptrace_test.c:603: WIFSTOPPED(status) not met

FAILED:  sys.kern.ptrace_test.ptrace__getppid

Error Message:
/usr/src/tests/sys/kern/ptrace_test.c:1091: read(cpipe[0], &ppid, sizeof(ppid)) (0) == (ssize_t)sizeof(ppid) (4) not met

FAILED:  usr.bin.bintrans.legacy_test.main

Error Message:
TAP test program yielded invalid data: Load of '/tmp/kyua.UiXyeG/4456/stdout.txt' failed: Reported plan differs from actual executed tests

FAILED:  sys.file.path_test.path_event

Error Message:
Test case body timed out