FreeBSD-main-amd64-test - Build #21147 - Still Unstable

From: <>
Date: Thu, 14 Apr 2022 10:48:09 UTC
FreeBSD-main-amd64-test - Build #21147 (3e0f3678eca7c3f296b9f702992737356f1792da) - Still Unstable

Build information:
Full change log:
Full build log:

Status explanation:
"Unstable" - some tests are suspected being broken by the following changes
"Still Unstable" - the failing test cases have not been fixed by these
                   following changes and this is a notification to note that
                   these changes have not been fully tested by the CI system

Change summaries:
(Those commits are likely but not certainly responsible)

7fa5cd38274e5e828496ef807af4226671106d93 by gbe:
Revert "drm2: Fix a typo in a source code comment"

239170f29210a21a68284dc967e57ed8047fb2ba by np:
cxgbe(4): Fix control flow issues reported by Coverity.

3e0f3678eca7c3f296b9f702992737356f1792da by gbe:
time(3): Refine history in the manual page

The failed test cases:

3 tests failed.
FAILED:  sys.kern.ptrace_test.ptrace__follow_fork_both_attached_unrelated_debugger

Error Message:
/usr/src/tests/sys/kern/ptrace_test.c:603: WIFSTOPPED(status) not met

FAILED:  sys.netpfil.common.dummynet.ipfw_queue

Error Message:
We failed prioritisation 1 times

FAILED:  sys.file.path_test.path_event

Error Message:
Test case body timed out