FreeBSD-main-amd64-test - Build #19944 - Still unstable

From: <>
Date: Tue, 30 Nov 2021 12:32:41 UTC
FreeBSD-main-amd64-test - Build #19944 (1b0602f2db94a4789da33302fbadfe5a57454277) - Still unstable

Build information:
Full change log:
Full build log:

Status explanation:
"Unstable" - some tests are suspected being broken by the following changes
"Still Unstable" - the failing test cases have not been fixed by these
                   following changes and this is a notification to note that
                   these changes have not been fully tested by the CI system

Change summaries:
(Those commits are likely but not certainly responsible)

27c4abc7cde0be8f9fdd8ac7725e9910b0cbf5d4 by gbe:
inet(3): Fix two typos in sysctl descriptions

5f8ccf6515288fd98896eaf0511eedd654cd3530 by gbe:
nvme(4): Correct a typo in a sysctl description

b15a632c418f6532fe7c3002b4085c61b1e278b0 by gbe:
if_hn: Fix a few typos in comments and a sysctl description

54c1a65736ec012b583ade1d53c477e182c574e4 by gbe:
ficl: Fix a typo in a comment

1dadeab36762c26f92f60bc43b1bf3854aa13d88 by gbe:
netinet: Fix a common typo in source code comments

c8ca80e22381e68f7cc23e8822f3ef5e6a68c3c0 by gbe:
elf(3): Fix a typo in a sysctl description

e3080a9cca1b94ded20b42b653b97e49306d94d2 by gbe:
xen(4): Fix two typos in source code comments

ddeb702f7b29d967f86ae705b5604c4fa81bb908 by gbe:
mpr(4): Fix a typo in a source code comment

1b0602f2db94a4789da33302fbadfe5a57454277 by gbe:
mips: Fix a typo in a source code comment

The failed test cases:

3 tests failed.
FAILED:  lib.libc.regex.exhaust_test.regcomp_too_big

Error Message:
Empty test result or no new line

FAILED:  sys.netinet.output.output_tcp_flowid_mpath_success

Error Message:
sender exit code 1

FAILED:  lib.libregex.exhaust_test.regcomp_too_big

Error Message:
Empty test result or no new line