FreeBSD-main-amd64-test - Build #19935 - Still Unstable

From: <>
Date: Mon, 29 Nov 2021 20:23:10 UTC
FreeBSD-main-amd64-test - Build #19935 (3dd3a395ba975d0fbe13320e6e69fb85b037da5e) - Still Unstable

Build information:
Full change log:
Full build log:

Status explanation:
"Unstable" - some tests are suspected being broken by the following changes
"Still Unstable" - the failing test cases have not been fixed by these
                   following changes and this is a notification to note that
                   these changes have not been fully tested by the CI system

Change summaries:
(Those commits are likely but not certainly responsible)

0190c38b9dfaa16de1bc61e829b9a1221fed7896 by kib:
swapoff_one(): only check free pages count manually turning swap off

08bb51f8d60c552d1f7c202cc2eb267ed480e541 by kib:
shutdown: unmount filesystems after swapoff

1cde21402ab7c2527dec1050f37b14ae077eafe7 by trasz:
cdceem(4): Fix "set but not used" warnings

fbf5246757630650c23ed711c527a67dd52eb745 by trasz:
cfiscsi(4): Fix "set but not used" warning

a089c17d320684e6eb36556fa131a8286e6a821d by trasz:
linux(4): Fix "set but not used" warnings

1910048eb931bb749c42534a8f252d772c0719de by bz:
USB: add CYUSB330x to usbdevs

3dd3a395ba975d0fbe13320e6e69fb85b037da5e by nc:
ext2: Check for e2fs_first_dblock in ext2_compute_sb_data()

The failed test cases:

3 tests failed.
FAILED:  lib.libc.regex.exhaust_test.regcomp_too_big

Error Message:
Empty test result or no new line

FAILED:  lib.libregex.exhaust_test.regcomp_too_big

Error Message:
Empty test result or no new line

FAILED:  sys.posixshm.posixshm_test.largepage_mprotect

Error Message:
/usr/src/tests/sys/posixshm/posixshm_test.c:1669: mmap(2097152 bytes) failed; error=28