FreeBSD-main-amd64-test - Build #19877 - Still Unstable

From: <jenkins-admin_at_FreeBSD.org>
Date: Tue, 23 Nov 2021 06:49:40 UTC
FreeBSD-main-amd64-test - Build #19877 (3bc40f39fd8668f0be71ca6ee5da513054080d7d) - Still Unstable

Build information: https://ci.FreeBSD.org/job/FreeBSD-main-amd64-test/19877/
Full change log: https://ci.FreeBSD.org/job/FreeBSD-main-amd64-test/19877/changes
Full build log: https://ci.FreeBSD.org/job/FreeBSD-main-amd64-test/19877/console

Status explanation:
"Unstable" - some tests are suspected being broken by the following changes
"Still Unstable" - the failing test cases have not been fixed by these
                   following changes and this is a notification to note that
                   these changes have not been fully tested by the CI system

Change summaries:
(Those commits are likely but not certainly responsible)

fe499a8452cd9c25a4949c33f4396966872ae589 by glebius:
ifnet: merge if_destroy() and if_free_internal() into one

3bc40f39fd8668f0be71ca6ee5da513054080d7d by glebius:
if_free: add a comment explaining why ifindex_free() is performed here



The failed test cases:

3 tests failed.
FAILED:  lib.libc.regex.exhaust_test.regcomp_too_big

Error Message:
Empty test result or no new line

FAILED:  lib.libc.sys.setrlimit_test.setrlimit_stack

Error Message:
Empty test result or no new line

FAILED:  sys.netpfil.common.dummynet.pf_nat

Error Message:
atf-check failed; see the output of the test for details