FreeBSD-main-amd64-test - Build #19867 - Still Unstable

From: <jenkins-admin_at_FreeBSD.org>
Date: Sun, 21 Nov 2021 03:31:20 UTC
FreeBSD-main-amd64-test - Build #19867 (036af1053acd6cae68c5fb6bed30508f2e40be13) - Still Unstable

Build information: https://ci.FreeBSD.org/job/FreeBSD-main-amd64-test/19867/
Full change log: https://ci.FreeBSD.org/job/FreeBSD-main-amd64-test/19867/changes
Full build log: https://ci.FreeBSD.org/job/FreeBSD-main-amd64-test/19867/console

Status explanation:
"Unstable" - some tests are suspected being broken by the following changes
"Still Unstable" - the failing test cases have not been fixed by these
                   following changes and this is a notification to note that
                   these changes have not been fully tested by the CI system

Change summaries:
(Those commits are likely but not certainly responsible)

036af1053acd6cae68c5fb6bed30508f2e40be13 by emaste:
mkimg: zero entry in vhdx_write_metadata



The failed test cases:

4 tests failed.
FAILED:  lib.libregex.exhaust_test.regcomp_too_big

Error Message:
Empty test result or no new line

FAILED:  lib.libc.sys.setrlimit_test.setrlimit_stack

Error Message:
Empty test result or no new line

FAILED:  sys.kern.coredump_phnum_test.coredump_phnum

Error Message:
atf-check failed; see the output of the test for details

FAILED:  sys.netpfil.common.dummynet.pf_nat

Error Message:
atf-check failed; see the output of the test for details