FreeBSD-main-amd64-test - Build #19850 - Still unstable

From: <jenkins-admin_at_FreeBSD.org>
Date: Fri, 19 Nov 2021 00:01:58 UTC
FreeBSD-main-amd64-test - Build #19850 (1ac5586c6d86134922e18871b270ca483c00bf8b) - Still unstable

Build information: https://ci.FreeBSD.org/job/FreeBSD-main-amd64-test/19850/
Full change log: https://ci.FreeBSD.org/job/FreeBSD-main-amd64-test/19850/changes
Full build log: https://ci.FreeBSD.org/job/FreeBSD-main-amd64-test/19850/console

Status explanation:
"Unstable" - some tests are suspected being broken by the following changes
"Still Unstable" - the failing test cases have not been fixed by these
                   following changes and this is a notification to note that
                   these changes have not been fully tested by the CI system

Change summaries:
(Those commits are likely but not certainly responsible)

1ac5586c6d86134922e18871b270ca483c00bf8b by 0mp:
style.Makefile.5: Do not require $FreeBSD$ SCM IDs



The failed test cases:

24 tests failed.
FAILED:  lib.libregex.exhaust_test.regcomp_too_big

Error Message:
Empty test result or no new line

FAILED:  lib.libc.sys.setrlimit_test.setrlimit_stack

Error Message:
Empty test result or no new line

FAILED:  sys.kern.coredump_phnum_test.coredump_phnum

Error Message:
atf-check failed; see the output of the test for details

FAILED:  usr.bin.mkimg.mkimg_test.apm_1x1_4096_vhdx

Error Message:
atf-check failed; see the output of the test for details

FAILED:  usr.bin.mkimg.mkimg_test.apm_1x1_512_vhdx

Error Message:
atf-check failed; see the output of the test for details

FAILED:  usr.bin.mkimg.mkimg_test.apm_63x255_4096_vhdx

Error Message:
atf-check failed; see the output of the test for details

FAILED:  usr.bin.mkimg.mkimg_test.apm_63x255_512_vhdx

Error Message:
atf-check failed; see the output of the test for details

FAILED:  usr.bin.mkimg.mkimg_test.bsd_1x1_4096_vhdx

Error Message:
atf-check failed; see the output of the test for details

FAILED:  usr.bin.mkimg.mkimg_test.bsd_1x1_512_vhdx

Error Message:
atf-check failed; see the output of the test for details

FAILED:  usr.bin.mkimg.mkimg_test.bsd_63x255_4096_vhdx

Error Message:
atf-check failed; see the output of the test for details

FAILED:  usr.bin.mkimg.mkimg_test.bsd_63x255_512_vhdx

Error Message:
atf-check failed; see the output of the test for details

FAILED:  usr.bin.mkimg.mkimg_test.ebr_1x1_4096_vhdx

Error Message:
atf-check failed; see the output of the test for details

FAILED:  usr.bin.mkimg.mkimg_test.ebr_1x1_512_vhdx

Error Message:
atf-check failed; see the output of the test for details

FAILED:  usr.bin.mkimg.mkimg_test.ebr_63x255_4096_vhdx

Error Message:
atf-check failed; see the output of the test for details

FAILED:  usr.bin.mkimg.mkimg_test.ebr_63x255_512_vhdx

Error Message:
atf-check failed; see the output of the test for details

FAILED:  usr.bin.mkimg.mkimg_test.gpt_1x1_4096_vhdx

Error Message:
atf-check failed; see the output of the test for details

FAILED:  usr.bin.mkimg.mkimg_test.gpt_1x1_512_vhdx

Error Message:
atf-check failed; see the output of the test for details

FAILED:  usr.bin.mkimg.mkimg_test.gpt_63x255_4096_vhdx

Error Message:
atf-check failed; see the output of the test for details

FAILED:  usr.bin.mkimg.mkimg_test.gpt_63x255_512_vhdx

Error Message:
atf-check failed; see the output of the test for details

FAILED:  usr.bin.mkimg.mkimg_test.mbr_1x1_4096_vhdx

Error Message:
atf-check failed; see the output of the test for details

FAILED:  usr.bin.mkimg.mkimg_test.mbr_1x1_512_vhdx

Error Message:
atf-check failed; see the output of the test for details

FAILED:  usr.bin.mkimg.mkimg_test.mbr_63x255_4096_vhdx

Error Message:
atf-check failed; see the output of the test for details

FAILED:  usr.bin.mkimg.mkimg_test.mbr_63x255_512_vhdx

Error Message:
atf-check failed; see the output of the test for details

FAILED:  sys.netpfil.common.dummynet.pf_nat

Error Message:
atf-check failed; see the output of the test for details