FreeBSD-main-amd64-test - Build #19838 - Still unstable

From: <jenkins-admin_at_FreeBSD.org>
Date: Thu, 18 Nov 2021 00:17:57 UTC
FreeBSD-main-amd64-test - Build #19838 (201d0ebee321fb1a5501e17a4f150aa211020c5c) - Still unstable

Build information: https://ci.FreeBSD.org/job/FreeBSD-main-amd64-test/19838/
Full change log: https://ci.FreeBSD.org/job/FreeBSD-main-amd64-test/19838/changes
Full build log: https://ci.FreeBSD.org/job/FreeBSD-main-amd64-test/19838/console

Status explanation:
"Unstable" - some tests are suspected being broken by the following changes
"Still Unstable" - the failing test cases have not been fixed by these
                   following changes and this is a notification to note that
                   these changes have not been fully tested by the CI system

Change summaries:
(Those commits are likely but not certainly responsible)

201d0ebee321fb1a5501e17a4f150aa211020c5c by mm:
libarchive: cherry-pick bugfix from vendor



The failed test cases:

24 tests failed.
FAILED:  lib.libc.regex.exhaust_test.regcomp_too_big

Error Message:
Empty test result or no new line

FAILED:  lib.libc.sys.setrlimit_test.setrlimit_stack

Error Message:
Empty test result or no new line

FAILED:  sys.kern.coredump_phnum_test.coredump_phnum

Error Message:
atf-check failed; see the output of the test for details

FAILED:  usr.bin.mkimg.mkimg_test.apm_1x1_4096_vhdx

Error Message:
atf-check failed; see the output of the test for details

FAILED:  usr.bin.mkimg.mkimg_test.apm_1x1_512_vhdx

Error Message:
atf-check failed; see the output of the test for details

FAILED:  usr.bin.mkimg.mkimg_test.apm_63x255_4096_vhdx

Error Message:
atf-check failed; see the output of the test for details

FAILED:  usr.bin.mkimg.mkimg_test.apm_63x255_512_vhdx

Error Message:
atf-check failed; see the output of the test for details

FAILED:  usr.bin.mkimg.mkimg_test.bsd_1x1_4096_vhdx

Error Message:
atf-check failed; see the output of the test for details

FAILED:  usr.bin.mkimg.mkimg_test.bsd_1x1_512_vhdx

Error Message:
atf-check failed; see the output of the test for details

FAILED:  usr.bin.mkimg.mkimg_test.bsd_63x255_4096_vhdx

Error Message:
atf-check failed; see the output of the test for details

FAILED:  usr.bin.mkimg.mkimg_test.bsd_63x255_512_vhdx

Error Message:
atf-check failed; see the output of the test for details

FAILED:  usr.bin.mkimg.mkimg_test.ebr_1x1_4096_vhdx

Error Message:
atf-check failed; see the output of the test for details

FAILED:  usr.bin.mkimg.mkimg_test.ebr_1x1_512_vhdx

Error Message:
atf-check failed; see the output of the test for details

FAILED:  usr.bin.mkimg.mkimg_test.ebr_63x255_4096_vhdx

Error Message:
atf-check failed; see the output of the test for details

FAILED:  usr.bin.mkimg.mkimg_test.ebr_63x255_512_vhdx

Error Message:
atf-check failed; see the output of the test for details

FAILED:  usr.bin.mkimg.mkimg_test.gpt_1x1_4096_vhdx

Error Message:
atf-check failed; see the output of the test for details

FAILED:  usr.bin.mkimg.mkimg_test.gpt_1x1_512_vhdx

Error Message:
atf-check failed; see the output of the test for details

FAILED:  usr.bin.mkimg.mkimg_test.gpt_63x255_4096_vhdx

Error Message:
atf-check failed; see the output of the test for details

FAILED:  usr.bin.mkimg.mkimg_test.gpt_63x255_512_vhdx

Error Message:
atf-check failed; see the output of the test for details

FAILED:  usr.bin.mkimg.mkimg_test.mbr_1x1_4096_vhdx

Error Message:
atf-check failed; see the output of the test for details

FAILED:  usr.bin.mkimg.mkimg_test.mbr_1x1_512_vhdx

Error Message:
atf-check failed; see the output of the test for details

FAILED:  usr.bin.mkimg.mkimg_test.mbr_63x255_4096_vhdx

Error Message:
atf-check failed; see the output of the test for details

FAILED:  usr.bin.mkimg.mkimg_test.mbr_63x255_512_vhdx

Error Message:
atf-check failed; see the output of the test for details

FAILED:  sys.netpfil.common.dummynet.pf_nat

Error Message:
atf-check failed; see the output of the test for details