FreeBSD-main-amd64-test - Build #19728 - Still Unstable

From: <jenkins-admin_at_FreeBSD.org>
Date: Sat, 06 Nov 2021 02:09:35 UTC
FreeBSD-main-amd64-test - Build #19728 (e900338c0987603456df8d9a8aeec5c239106d0b) - Still Unstable

Build information: https://ci.FreeBSD.org/job/FreeBSD-main-amd64-test/19728/
Full change log: https://ci.FreeBSD.org/job/FreeBSD-main-amd64-test/19728/changes
Full build log: https://ci.FreeBSD.org/job/FreeBSD-main-amd64-test/19728/console

Status explanation:
"Unstable" - some tests are suspected being broken by the following changes
"Still Unstable" - the failing test cases have not been fixed by these
                   following changes and this is a notification to note that
                   these changes have not been fully tested by the CI system

Change summaries:
(Those commits are likely but not certainly responsible)

e900338c0987603456df8d9a8aeec5c239106d0b by jhb:
Move the ICL_CONN_*LOCK* macros to <dev/iscsi/icl.h>.



The failed test cases:

28 tests failed.
FAILED:  usr.bin.awk.bugs-fixed.bug_fix_test.pfile_overflow

Error Message:
Test case body returned a non-ok exit code, but this is not allowed

FAILED:  sys.geom.class.eli.attach_test.attach_d

Error Message:
atf-check failed; see the output of the test for details

FAILED:  sys.geom.class.eli.attach_test.attach_multiple

Error Message:
atf-check failed; see the output of the test for details

FAILED:  sys.geom.class.eli.attach_test.attach_r

Error Message:
atf-check failed; see the output of the test for details

FAILED:  sys.geom.class.eli.attach_test.nokey

Error Message:
atf-check failed; see the output of the test for details

FAILED:  sys.geom.class.eli.configure_test.configure_b_B

Error Message:
atf-check failed; see the output of the test for details

FAILED:  sys.geom.class.eli.delkey_test.delkey

Error Message:
atf-check failed; see the output of the test for details

FAILED:  sys.geom.class.eli.delkey_test.delkey_readonly

Error Message:
atf-check failed; see the output of the test for details

FAILED:  sys.geom.class.eli.detach_test.detach_l

Error Message:
atf-check failed; see the output of the test for details

FAILED:  sys.geom.class.eli.init_test.init

Error Message:
atf-check failed; see the output of the test for details

FAILED:  sys.geom.class.eli.init_test.init_B

Error Message:
atf-check failed; see the output of the test for details

FAILED:  sys.geom.class.eli.init_test.init_J

Error Message:
atf-check failed; see the output of the test for details

FAILED:  sys.geom.class.eli.init_test.init_a

Error Message:
atf-check failed; see the output of the test for details

FAILED:  sys.geom.class.eli.init_test.init_alias

Error Message:
atf-check failed; see the output of the test for details

FAILED:  sys.geom.class.eli.integrity_test.copy

Error Message:
atf-check failed; see the output of the test for details

FAILED:  sys.geom.class.eli.integrity_test.data

Error Message:
atf-check failed; see the output of the test for details

FAILED:  sys.geom.class.eli.integrity_test.hmac

Error Message:
atf-check failed; see the output of the test for details

FAILED:  sys.geom.class.eli.kill_test.kill

Error Message:
atf-check failed; see the output of the test for details

FAILED:  sys.geom.class.eli.kill_test.kill_readonly

Error Message:
atf-check failed; see the output of the test for details

FAILED:  sys.geom.class.eli.online_resize_test.online_resize

Error Message:
Test case body returned a non-ok exit code, but this is not allowed

FAILED:  sys.geom.class.eli.reentrancy_test.init

Error Message:
atf-check failed; see the output of the test for details

FAILED:  sys.geom.class.eli.resize_test.resize

Error Message:
atf-check failed; see the output of the test for details

FAILED:  sys.geom.class.eli.setkey_test.nokey

Error Message:
atf-check failed; see the output of the test for details

FAILED:  sys.geom.class.eli.setkey_test.setkey

Error Message:
atf-check failed; see the output of the test for details

FAILED:  sys.geom.class.eli.setkey_test.setkey_readonly

Error Message:
atf-check failed; see the output of the test for details

FAILED:  sys.geom.class.mirror.component_selection.run_latest_genid

Error Message:
atf-check failed; see the output of the test for details

FAILED:  sys.geom.class.mirror.sync_error.sync_read_error_2_disks

Error Message:
atf-check failed; see the output of the test for details

FAILED:  sys.geom.class.mirror.sync_error.sync_read_error_3_disks

Error Message:
atf-check failed; see the output of the test for details