FreeBSD-main-amd64-test - Build #20134 - Still Unstable

From: <>
Date: Sat, 18 Dec 2021 22:58:15 UTC
FreeBSD-main-amd64-test - Build #20134 (8b60419b798ae9049988c529e6af3f313a5cce55) - Still Unstable

Build information:
Full change log:
Full build log:

Status explanation:
"Unstable" - some tests are suspected being broken by the following changes
"Still Unstable" - the failing test cases have not been fixed by these
                   following changes and this is a notification to note that
                   these changes have not been fully tested by the CI system

Change summaries:
(Those commits are likely but not certainly responsible)

34077a8ed39f40da4b7faffff0b112f1dcb62ab4 by hselasky:
usb(4): Fix build after 45b48cbc2b5819cd6e3dee3632d66e55d5d7c101.

8b60419b798ae9049988c529e6af3f313a5cce55 by hselasky:
usb(4): Fix build on 32-bit platforms after

The failed test cases:

3 tests failed.
FAILED:  lib.libnv.nvlist_send_recv_test.nvlist_send_recv__send_many_fds__dgram

Error Message:
/usr/src/lib/libnv/tests/nvlist_send_recv_test.c:457: nvl != NULL not met

FAILED:  libexec.tftpd.functional.s_flag_v4

Error Message:
Test case body timed out

FAILED:  sys.netmap.ctrl-api-test.main

Error Message:
Returned non-success exit status 255