kernel build failure amd64

Christopher Vance c at
Wed Jan 12 18:32:38 PST 2005

On Thu, Jan 13, 2005 at 11:51:24AM +1100, I wrote:
>Recent cvsup with cvs up.
>Removed /usr/obj/.../src/sys/GENERIC.
>(cd /usr/src; make kernel) dies with

>/d2/FreeBSD/root/5-stable/usr/src/sys/dev/kbd/atkbd.c:1120: error: 
>`KB_CONF_NO_PROBE_TEST' undeclared (first use in this function)
>/d2/FreeBSD/root/5-stable/usr/src/sys/dev/kbd/atkbd.c:1120: error: (Each 
>undeclared identifier is reported only once
>/d2/FreeBSD/root/5-stable/usr/src/sys/dev/kbd/atkbd.c:1120: error: for each 
>function it appears in.)
>*** Error code 1
>The only file mentioning KB_CONF_NO_PROBE_TEST in any version appears
>to be src/sys/dev/kbd/atkbd.c, with no definition anywhere.

cvs repo was broken, so cvsup not working right, or something similar

sorry to bother you

Christopher Vance

More information about the freebsd-stable mailing list