gmake[2]: *** [cairo-1.0.typelib] Segmentation fault: 11 (core dumped)

pbrath at gmx.de pbrath at gmx.de
Fri Dec 4 16:42:54 UTC 2009


Hi,

I cannot build gobject-introspection-0.6.5_1.
FreeBSD 7.2, i386
The ports tree is up to date.

Today, the 4th decembrie 2009

..................
===>  Building for gobject-introspection-0.6.5_1
gmake  all-recursive
gmake[1]: Entering directory `/usr/ports/devel/gobject-introspection/work/gobject-introspection-0.6.5'
Making all in girepository
gmake[2]: Entering directory `/usr/ports/devel/gobject-introspection/work/gobject-introspection-0.6.5/girepository'
  CC     libgirepository_1_0_la-girepository.lo
  CC     libgirepository_1_0_la-gtypelib.lo
  CC     libgirepository_1_0_la-gfield.lo
  CC     libgirepository_1_0_la-ginfo.lo
  CC     libgirepository_1_0_la-girffi.lo
  CC     libgirepository_1_0_la-gdump.lo
  CC     libgirepository_1_0_la-ginvoke.lo
  CCLD   libgirepository-1.0.la
  CC     libgirepository_parser_la-girmodule.lo
  CC     libgirepository_parser_la-girnode.lo
  CC     libgirepository_parser_la-giroffsets.lo
  CC     libgirepository_parser_la-girparser.lo
  CCLD   libgirepository-parser.la
gmake[2]: Leaving directory `/usr/ports/devel/gobject-introspection/work/gobject-introspection-0.6.5/girepository'
Making all in giscanner
gmake[2]: Entering directory `/usr/ports/devel/gobject-introspection/work/gobject-introspection-0.6.5/giscanner'
gmake  all-am
gmake[3]: Entering directory `/usr/ports/devel/gobject-introspection/work/gobject-introspection-0.6.5/giscanner'
  CC     libgiscanner_la-sourcescanner.lo
  CC     libgiscanner_la-scannerlexer.lo
  CC     libgiscanner_la-scannerparser.lo
  CCLD   libgiscanner.la
  CC     _giscanner_la-giscannermodule.lo
  CCLD   _giscanner.la
gmake[3]: Leaving directory `/usr/ports/devel/gobject-introspection/work/gobject-introspection-0.6.5/giscanner'
gmake[2]: Leaving directory `/usr/ports/devel/gobject-introspection/work/gobject-introspection-0.6.5/giscanner'
Making all in tools
gmake[2]: Entering directory `/usr/ports/devel/gobject-introspection/work/gobject-introspection-0.6.5/tools'
  CC     g_ir_compiler-compiler.o
  CCLD   g-ir-compiler
  CC     g_ir_generate-generate.o
  CCLD   g-ir-generate
sed -e s, at libdir\@,/usr/local/lib, -e s, at PYTHON\@,/usr/local/bin/python2.6, g-ir-scanner.in > g-ir-scanner.tmp && mv g-ir-scanner.tmp g-ir-scanner
chmod a+x g-ir-scanner
gmake[2]: Leaving directory `/usr/ports/devel/gobject-introspection/work/gobject-introspection-0.6.5/tools'
Making all in gir
gmake[2]: Entering directory `/usr/ports/devel/gobject-introspection/work/gobject-introspection-0.6.5/gir'
  CC     libgirepository_everything_1_0_la-everything.lo
  CCLD   libgirepository-everything-1.0.la
  GEN    GLib-2.0.gir
/usr/include/machine/endian.h:146: syntax error, unexpected '{'
/usr/include/machine/endian.h:146: syntax error, unexpected ';'
/usr/include/machine/endian.h:153: syntax error, unexpected '{'
/usr/include/machine/endian.h:153: syntax error, unexpected ';'
  GEN    GLib-2.0.gir
  GEN    GObject-2.0.gir
  GEN    GObject-2.0.gir
  GEN    GModule-2.0.gir
  GEN    Gio-2.0.gir
  GEN    GIRepository-2.0.gir
  GEN    Everything-1.0.gir
../tools/g-ir-compiler --includedir=.  cairo-1.0.gir -o cairo-1.0.typelib
gmake[2]: *** [cairo-1.0.typelib] Segmentation fault: 11 (core dumped)
gmake[2]: *** Deleting file `cairo-1.0.typelib'
gmake[2]: Leaving directory `/usr/ports/devel/gobject-introspection/work/gobject-introspection-0.6.5/gir'
gmake[1]: *** [all-recursive] Error 1
gmake[1]: Leaving directory `/usr/ports/devel/gobject-introspection/work/gobject-introspection-0.6.5'
gmake: *** [all] Error 2
*** Error code 1

Stop in /usr/ports/devel/gobject-introspection.
______________________________________________________
GRATIS für alle WEB.DE-Nutzer: Die maxdome Movie-FLAT!
Jetzt freischalten unter http://movieflat.web.de



More information about the freebsd-gnome mailing list