cvs commit: ports/games/evq3 Makefile

QA Tindy itetcu at
Thu Aug 14 05:44:13 UTC 2008


The build which triggered this email is done under tinderbox-2.4.3, on 
7-STABLE on amd64, with tinderd_flags="-nullfs -plistcheck -onceonly"
and ccache support, with the "official" up-to-date Ports Tree, with the
following vars set:

Excerpt from

building evq3-1.3.20080810 in directory /var/tinderbox/7-STABLE-FTP
maintained by: alepulver at
building for:  7.0-STABLE amd64
port directory: /usr/ports/games/evq3
Makefile ident: $FreeBSD: ports/games/evq3/Makefile,v 1.11 2008/08/14 01:27:48 alepulver Exp $
prefixes: LOCALBASE=usr/local X11BASE=usr/local
build started at Thu Aug 14 01:30:29 UTC 2008

.................................<Last 40 lines of the log>..................

BOT_CC code/botlib/be_aas_reach.c
BOT_CC code/botlib/be_aas_route.c
BOT_CC code/botlib/be_aas_routealt.c
BOT_CC code/botlib/be_aas_sample.c
BOT_CC code/botlib/be_ai_char.c
BOT_CC code/botlib/be_ai_chat.c
BOT_CC code/botlib/be_ai_gen.c
BOT_CC code/botlib/be_ai_goal.c
BOT_CC code/botlib/be_ai_move.c
BOT_CC code/botlib/be_ai_weap.c
BOT_CC code/botlib/be_ai_weight.c
BOT_CC code/botlib/be_ea.c
BOT_CC code/botlib/be_interface.c
BOT_CC code/botlib/l_crc.c
BOT_CC code/botlib/l_libvar.c
BOT_CC code/botlib/l_log.c
BOT_CC code/botlib/l_memory.c
BOT_CC code/botlib/l_precomp.c
BOT_CC code/botlib/l_script.c
BOT_CC code/botlib/l_struct.c
DED_CC code/null/null_client.c
DED_CC code/null/null_input.c
DED_CC code/null/null_snddma.c
DED_CC code/sys/con_log.c
DED_CC code/sys/sys_main.c
DED_CC code/qcommon/vm_x86_64.c
code/qcommon/vm_x86_64.c: In function 'VM_Compile':
code/qcommon/vm_x86_64.c:537: error: 'MAP_ANONYMOUS' undeclared (first use in this function)
code/qcommon/vm_x86_64.c:537: error: (Each undeclared identifier is reported only once
code/qcommon/vm_x86_64.c:537: error: for each function it appears in.)
gmake[2]: *** [build/release/ded/vm_x86_64.o] Error 1
gmake[2]: Leaving directory `/work/a/ports/games/evq3/work/evq3'
gmake[1]: *** [targets] Error 2
gmake[1]: Leaving directory `/work/a/ports/games/evq3/work/evq3'
gmake: *** [release] Error 2
*** Error code 2

Stop in /a/ports/games/evq3.
build of /usr/ports/games/evq3 ended at Thu Aug 14 01:31:57 UTC 2008

A description of the testing process can be found here:

Thanks for your work on making FreeBSD better,

IOnut - Un^d^dregistered ;) FreeBSD "user"
  "Intellectual Property" is   nowhere near as valuable   as "Intellect"
FreeBSD committer -> itetcu at, PGP Key ID 057E9F8B493A297B

More information about the cvs-ports mailing list