cvs commit: ports/security/gnupg-devel Makefile distinfo pkg-plist ports/security/gnupg-devel/files patch-agent-command_ssh.c patch-configure

Michael L. Hostbaek mich at
Tue Jun 28 08:28:20 GMT 2005

Michael Nottebrock (lofi) writes:
> lofi        2005-06-24 20:21:09 UTC
>   Log:
>   Update to 1.9.17

This update seems to break the build on my system:

cc -I/usr/local/include  -I/usr/local/include -I/usr/local/include
-I/usr/local/include -I/usr/local/include/pth -O -pipe
-I/usr/local/include/pth -Wall  -L/usr/local/lib/pth -L/usr/local/lib -o
scdaemon  scdaemon.o command.o apdu.o ccid-driver.o iso7816.o tlv.o
app.o app-help.o app-openpgp.o app-nks.o app-dinsig.o app-p15.o
../gl/libgnu.a ../jnlib/libjnlib.a ../common/libcommon.a
-L/usr/local/lib -lgcrypt -L/usr/local/lib -lgpg-error -L/usr/local/lib
-lksba -lgpg-error -L/usr/local/lib/pth -lpth -L/usr/local/lib -lassuan
-lgpg-error /usr/local/lib/ -Wl,-rpath -Wl,/usr/local/lib  -lz
scdaemon.o(.text+0xab2): In function `main':
: undefined reference to `ccid_set_debug_level'
scdaemon.o(.text+0xabb): In function `main':
: undefined reference to `ccid_set_debug_level'
gmake[2]: *** [scdaemon] Error 1
gmake[2]: Leaving directory
gmake[1]: *** [all-recursive] Error 1
gmake[1]: Leaving directory
gmake: *** [all] Error 2
*** Error code 2

Stop in /usr/ports/security/gnupg-devel.
zsh: 92715 exit 1     make

root at mich2 security/gnupg-devel# gcc -v 
Using built-in specs.
Configured with: FreeBSD/i386 system compiler
Thread model: posix
gcc version 3.4.2 [FreeBSD] 20040728

root at mich2 security/gnupg-devel# uname -a
FreeBSD 5.4-STABLE FreeBSD 5.4-STABLE #0: Mon May  9
17:19:44 CEST 2005
root at  i386


More information about the cvs-ports mailing list